Target
Beta-1 adrenergic receptor
Ligand
BDBM16173
Substrate
Ki
>10000±n/a nM
Comments
PDSP_2650
Citation
 Garritsen, AIjzerman, APTulp, MTCragoe, EJSoudijn, W Receptor binding profiles of amiloride analogues provide no evidence for a link between receptors and the Na+/H+ exchanger, but indicate a common structure on receptor proteins. J Recept Res 11:891-907 (1991)  
Target
Name:
Beta-1 adrenergic receptor
Synonyms:
ADRB1R, B1AR Adrb1 Adrenergic receptor beta Beta-1 adrenoreceptor adrenergic Beta1,2
Type:
Protein
Mol. Mass.:
50486.84
Organism:
Rattus norvegicus (Rat)
Description:
P18090
Residue:
466
  
Inhibitor
Name:
BDBM16173
Synonyms:
3,5-diamino-6-chloro-N-(diaminomethylene)pyrazinamide;hydrochloride Amiloride CHEMBL945
Type:
Small organic molecule
Emp. Form.:
C6H8ClN7O
Mol. Mass.:
229.627
SMILES:
NC(=N)NC(=O)c1nc(Cl)c(N)nc1N
: