Target
Vasopressin V2 receptor
Ligand
BDBM81892
Substrate
Ki
550±n/a nM
Comments
PDSP_1041
Citation
 Pettibone, DJClineschmidt, BVLis, EVReiss, DRTotaro, JAWoyden, CJBock, MGFreidinger, RMTung, RDVeber, DF In vitro pharmacological profile of a novel structural class of oxytocin antagonists. J Pharmacol Exp Ther 256:304-8 (1991) Target
Name:
Vasopressin V2 receptor
Synonyms:
AVPR V2 Avpr2 V2R_RAT Vasopressin receptor
Type:
G-protein coupled receptor
Mol. Mass.:
40761.85
Organism:
Rattus norvegicus (Rat)
Description:
Residue:
371
  
Inhibitor
Name:
BDBM81892
Synonyms:
Cyclo[L-Pro-D-Phe-L-Ile-1,6-didehydro-D-Pyz-N-methyl-D-Phe-] L-366,706
Type:
Small organic molecule
Emp. Form.:
C35H44N6O5
Mol. Mass.:
628.7611
SMILES:
CCC(C)C1NC(=O)[C@H](Cc2ccccc2)NC(=O)[C@H]2CCCN2C(=O)C(Cc2ccccc2)N(C)C(=O)[C@H]2CCC=NN2C1=O
: