Target
Mu-type opioid receptor
Ligand
BDBM50021560
Substrate
Ki
0.97±n/a nM
Comments
PDSP_1280
Citation
 Raynor, KKong, HChen, YYasuda, KYu, LBell, GIReisine, T Pharmacological characterization of the cloned kappa-, delta-, and mu-opioid receptors. Mol Pharmacol 45:330-4 (1994) Target
Name:
Mu-type opioid receptor
Synonyms:
M-OR-1 MOR-1 MUOR1 Mu opiate receptor OPRM1 hMOP | mu-type opioid receptor isoform MOR-1
Type:
G Protein-Coupled Receptor (GPCR)
Mol. Mass.:
44789.51
Organism:
Homo sapiens (Human)
Description:
P35372
Residue:
400
  
Inhibitor
Name:
BDBM50021560
Synonyms:
4-allyl-(13R,14S)-12-oxa-4-azapentacyclo[9.6.1.01,13.05,17.07,18]octadeca-7(18),8,10,15-tetraene-10,14-diol:hydrocholride(Nalorphine) 4-allyl-(1S,13R,14S)-12-oxa-4-azapentacyclo[9.6.1.01,13.05,17.07,18]octadeca-7(18),8,10,15-tetraene-10,14-diolhydrochloride(Nalorphine hydrochloride) CHEMBL553080 | NALORPHINE - HCI
Type:
Small organic molecule
Emp. Form.:
C19H21NO3
Mol. Mass.:
311.3749
SMILES:
O[C@H]1C=CC2[C@H]3Cc4ccc(O)c5O[C@@H]1[C@]2(CCN3CC=C)c45
: