Target
Endoribonuclease toxin MazF
Ligand
BDBM83472
Substrate
Meas. Tech.
Dose response confirmation uHTS hits for MazEF TA System activators via a fluorescence-based single-stranded RNase assay counterscreen
EC50
30500±n/a nM
Citation
 PubChem, PC Dose response confirmation uHTS hits for MazEF TA System activators via a fluorescence-based single-stranded RNase assay counterscreen PubChem Bioassay (2011)[AID] 
Target
Name:
Endoribonuclease toxin MazF
Synonyms:
MAZF_ECOLI chpAK mazF
Type:
Enzyme Catalytic Domain
Mol. Mass.:
12100.43
Organism:
Escherichia coli str. K-12 substr. MG1655
Description:
gi_16130689
Residue:
111
  
Inhibitor
Name:
BDBM83472
Synonyms:
3-bromo-5-(5-bromo-2-furanyl)-7-(trifluoromethyl)-2-pyrazolo[1,5-a]pyrimidinecarboxylic acid methyl ester MLS000079492 cid_659904 methyl 3-bromo-5-(5-bromofuran-2-yl)-7-(trifluoromethyl)pyrazolo[1,5-a]pyrimidine-2-carboxylate
Type:
Small organic molecule
Emp. Form.:
C13H6Br2F3N3O3
Mol. Mass.:
469.008
SMILES:
COC(=O)c1nn2c(cc(nc2c1Br)-c1ccc(Br)o1)C(F)(F)F
: