Target
Endoribonuclease toxin MazF
Ligand
BDBM67581
Substrate
Meas. Tech.
Dose response confirmation uHTS hits for MazEF TA System activators via a fluorescence-based single-stranded RNase assay counterscreen
EC50
>99000±n/a nM
Citation
 PubChem, PC Dose response confirmation uHTS hits for MazEF TA System activators via a fluorescence-based single-stranded RNase assay counterscreen PubChem Bioassay (2011)[AID] 
Target
Name:
Endoribonuclease toxin MazF
Synonyms:
MAZF_ECOLI chpAK mazF
Type:
Enzyme Catalytic Domain
Mol. Mass.:
12100.43
Organism:
Escherichia coli str. K-12 substr. MG1655
Description:
gi_16130689
Residue:
111
  
Inhibitor
Name:
BDBM67581
Synonyms:
MLS000050452 N-(5-chloro-2-hydroxy-phenyl)-2-ethoxy-benzamide SMR000076353 | cid_2953683
Type:
Small organic molecule
Emp. Form.:
C15H14ClNO3
Mol. Mass.:
291.73
SMILES:
CCOc1ccccc1C(=O)Nc1cc(Cl)ccc1O
: