Target
Somatostatin receptor type 5
Ligand
BDBM50097783
Substrate
Ki
0.29±n/a nM
Comments
PDSP_1765
Citation
 Raynor, KO'Carroll, AMKong, HYasuda, KMahan, LCBell, GIReisine, T Characterization of cloned somatostatin receptors SSTR4 and SSTR5. Mol Pharmacol 44:385-92 (1993) Target
Name:
Somatostatin receptor type 5
Synonyms:
SOMATOSTATIN SST5 SS5-R SSR5_HUMAN Somatostatin receptor type 5 (SSTR5)
Type:
Enzyme
Mol. Mass.:
39218.02
Organism:
Homo sapiens (Human)
Description:
P35346
Residue:
364
  
Inhibitor
Name:
BDBM50097783
Synonyms:
CHEMBL438401 SOMATOSTATIN | SRIF-D-Trp8
Type:
Small organic molecule
Emp. Form.:
C76H104N18O19S2
Mol. Mass.:
1637.878
SMILES:
C[C@@H](O)[C@@H]1NC(=O)[C@@H](Cc2ccccc2)NC(=O)[C@@H](NC(=O)[C@@H](CCCCN)NC(=O)[C@H](Cc2c[nH]c3ccccc23)NC(=O)[C@@H](Cc2ccccc2)NC(=O)[C@H](Cc2ccccc2)NC(=O)[C@@H](CC(N)=O)NC(=O)[C@H](CCCCN)NC(=O)[C@H](CSSC[C@@H](NC(=O)[C@@H](CO)NC1=O)C(O)=O)NC(=O)CNC(=O)[C@H](C)N)C(C)O
: