Target
Alpha-1A adrenergic receptor
Ligand
BDBM50026777
Substrate
Ki
>10000±n/a nM
Comments
PDSP_1222
Citation
 Hirasawa, AHorie, KTanaka, TTakagaki, KMurai, MYano, JTsujimoto, G Cloning, functional expression and tissue distribution of human cDNA for the alpha 1C-adrenergic receptor. Biochem Biophys Res Commun 195:902-9 (1993)  
Target
Name:
Alpha-1A adrenergic receptor
Synonyms:
ADA1A_HUMAN ADRA1C Alpha 1A-adrenoceptor Alpha adrenergic receptor 1a Alpha-adrenergic receptor 1c adrenergic Alpha1 | adrenergic Alpha1C
Type:
Cell-surface receptors
Mol. Mass.:
51511.67
Organism:
Homo sapiens (Human)
Description:
P35348
Residue:
466
  
Inhibitor
Name:
BDBM50026777
Synonyms:
2-Amino-1-(2,5-dimethoxy-phenyl)-propan-1-ol 2-Amino-1-(2,5-dimethoxy-phenyl)-propan-1-ol(Methoxamine) METHOXAMINE | Vasoxyl
Type:
Small organic molecule
Emp. Form.:
C11H17NO3
Mol. Mass.:
211.2576
SMILES:
COc1ccc(OC)c(c1)C(O)C(C)N
: