Target
Carbonic anhydrase 12
Ligand
BDBM50239278
Substrate
Meas. Tech.
ChEMBL_1665871 (CHEMBL4015667)
Ki
3.3±n/a nM
Citation
 Bruno, EBuemi, MRDi Fiore, ADe Luca, LFerro, SAngeli, ACirilli, RSadutto, DAlterio, VMonti, SMSupuran, CTDe Simone, GGitto, R Probing Molecular Interactions between Human Carbonic Anhydrases (hCAs) and a Novel Class of Benzenesulfonamides. J Med Chem 60:4316-4326 (2017)  
Target
Name:
Carbonic anhydrase 12
Synonyms:
CA-XII CAH12_HUMAN Carbonic anhydrase Carbonic anhydrase XII Carbonic anhydrase XII (CAXII) | Tumor antigen HOM-RCC-3.1.3
Type:
Enzyme
Mol. Mass.:
39456.00
Organism:
Homo sapiens (Human)
Description:
Catalytic domain of human cloned isozyme was used in the assay
Residue:
354
  
Inhibitor
Name:
BDBM50239278
Synonyms:
CHEMBL4095957
Type:
Small organic molecule
Emp. Form.:
C22H20N2O5S
Mol. Mass.:
424.47
SMILES:
NS(=O)(=O)c1ccc(cc1)C(=O)N1CCc2cc(O)c(O)cc2[C@@H]1c1ccccc1
: