Target
Sigma non-opioid intracellular receptor 1
Ligand
BDBM50000605
Substrate
Meas. Tech.
ChEMBL_201751 (CHEMBL809885)
IC50
432±n/a nM
Citation
 Erickson, RHNatalie, KJBock, WLu, ZFarzin, FSherrill, RGMeloni, DJPatch, RJRzesotarski, WJClifton, J (Aminoalkoxy)chromones. Selective sigma receptor ligands. J Med Chem 35:1526-35 (1992)  
Target
Name:
Sigma non-opioid intracellular receptor 1
Synonyms:
Aging-associated gene 8 protein SGMR1_HUMAN SIGMAR1 SR31747-binding protein Sigma 1-type opioid receptor Sigma1R | hSigmaR1
Type:
Enzyme Catalytic Domain
Mol. Mass.:
25124.85
Organism:
Homo sapiens (Human)
Description:
Q99720
Residue:
223
  
Inhibitor
Name:
BDBM50000605
Synonyms:
6-(6-Dimethylamino-hexyloxy)-2-phenyl-chromen-4-one | CHEMBL38585
Type:
Small organic molecule
Emp. Form.:
C23H27NO3
Mol. Mass.:
365.4654
SMILES:
CN(C)CCCCCCOc1ccc2oc(cc(=O)c2c1)-c1ccccc1
: