Target
Histone deacetylase 1/2/3/6
Ligand
BDBM50239824
Substrate
Meas. Tech.
ChEMBL_1667225 (CHEMBL4017021)
IC50
480±n/a nM
Citation
 Krieger, VHamacher, AGertzen, CGWSenger, JZwinderman, MRHMarek, MRomier, CDekker, FJKurz, TJung, MGohlke, HKassack, MUHansen, FK Design, Multicomponent Synthesis, and Anticancer Activity of a Focused Histone Deacetylase (HDAC) Inhibitor Library with Peptoid-Based Cap Groups. J Med Chem 60:5493-5506 (2017)  
Target
Name:
Histone deacetylase 1/2/3/6
Synonyms:
Type:
Mol. Mass.:
Description:
ASSAY_ID of ChEMBL is 1667226
Components:
This complex has 4 components.
Component 1
Name:
Histone deacetylase 1
Synonyms:
Cereblon/Histone deacetylase 1 HDAC1 Histone deacetylase 1 (HDAC1) RPD3L1
Type:
Enzyme
Mol. Mass.:
55090.27
Organism:
Homo sapiens (Human)
Description:
Q13547
Residue:
482
  
Component 2
Name:
Histone deacetylase 3
Synonyms:
HD3 HDAC3_HUMAN Human HDAC3 SMAP45
Type:
Enzyme
Mol. Mass.:
48829.55
Organism:
Homo sapiens (Human)
Description:
O15379
Residue:
428
  
Component 3
Name:
Histone deacetylase 6
Synonyms:
Cereblon/Histone deacetylase 6 HDAC6 Histone deacetylase 6 (HDAC6) KIAA0901 | ORF Names:JM21
Type:
Chromatin regulator; hydrolase; repressor
Mol. Mass.:
131381.51
Organism:
Homo sapiens (Human)
Description:
Q9UBN7
Residue:
1215
  
Component 4
Name:
Histone deacetylase 2
Synonyms:
Cereblon/Histone deacetylase 2 HDAC2 Histone deacetylase 2 (HDAC2) | Human HDAC2
Type:
Chromatin regulator; hydrolase; repressor
Mol. Mass.:
55356.54
Organism:
Homo sapiens (Human)
Description:
Q92769
Residue:
488
  
Inhibitor
Name:
BDBM50239824
Synonyms:
CHEMBL4069631
Type:
Small organic molecule
Emp. Form.:
C24H32N4O4
Mol. Mass.:
440.5353
SMILES:
CN(C)c1ccc(cc1)C(=O)N(CCCCCC(=O)NO)CC(=O)NCc1ccccc1
: