Target
Delta-type opioid receptor
Ligand
BDBM50000800
Substrate
Meas. Tech.
ChEMBL_146758 (CHEMBL753486)
IC50
55±n/a nM
Citation
 Toth, GRussell, KCLandis, GKramer, THFang, LKnapp, RDavis, PBurks, TFYamamura, HIHruby, VJ Ring substituted and other conformationally constrained tyrosine analogues of [D-Pen2,D-Pen5]enkephalin with delta opioid receptor selectivity. J Med Chem 35:2384-91 (1992)  
Target
Name:
Delta-type opioid receptor
Synonyms:
Cytochrome P450 3A4 Delta opioid receptor Delta-type opioid receptor (DOR) OPRD_RAT Opioid receptor Opioid receptors; mu & delta Ror-a | Voltage-gated potassium channel
Type:
G Protein-Coupled Receptor (GPCR)
Mol. Mass.:
40465.04
Organism:
Rattus norvegicus (rat)
Description:
Competition binding assays were using CHO-K1 cell membranes expressing the opioid receptor.
Residue:
372
  
Inhibitor
Name:
BDBM50000800
Synonyms:
13-[2-Amino-3-(4-hydroxy-3-iodo-phenyl)-propionylamino]-7-benzyl-3,3,14,14-tetramethyl-6,9,12-trioxo-1,2-dithia-5,8,11-triaza-cyclotetradecane-4-carboxylic acid | CHEMBL80504
Type:
Small organic molecule
Emp. Form.:
C30H38IN5O7S2
Mol. Mass.:
771.686
SMILES:
CC1(C)SSC(C)(C)[C@@H](NC(=O)[C@@H](N)Cc2ccc(O)c(I)c2)C(=O)NCC(=O)N[C@@H](Cc2ccccc2)C(=O)N[C@H]1C(O)=O
: