Target
Alpha-2B adrenergic receptor
Ligand
BDBM50240277
Substrate
Meas. Tech.
ChEMBL_1667956 (CHEMBL4017844)
IC50
8000±n/a nM
Citation
 Roecker, AJEgbertson, MJones, KLGGomez, RKraus, RLLi, YKoser, AJUrban, MOKlein, RClements, MPanigel, JDaley, CWang, JFinger, ENMajercak, JSantarelli, VGregan, ICato, MFilzen, TJovanovska, AWang, YHWang, DJoyce, LASherer, ECPeng, XWang, XSun, HColeman, PJHoughton, AKLayton, ME Discovery of selective, orally bioavailable, N-linked arylsulfonamide Na Bioorg Med Chem Lett 27:2087-2093 (2017)  
Target
Name:
Alpha-2B adrenergic receptor
Synonyms:
ADA2B_HUMAN ADRA2L1 Adrenergic alpha2B Adrenergic receptor alpha Alpha-2 adrenergic receptor subtype C2 Alpha-2B adrenoreceptor | Alpha-2BAR
Type:
Enzyme
Mol. Mass.:
49964.20
Organism:
Homo sapiens (Human)
Description:
P18089
Residue:
450
  
Inhibitor
Name:
BDBM50240277
Synonyms:
CHEMBL4061793
Type:
Small organic molecule
Emp. Form.:
C17H20ClFN4O2S2
Mol. Mass.:
430.948
SMILES:
Fc1cc(NCC23CCCN2CCC3)c(Cl)cc1S(=O)(=O)Nc1nccs1
: