Target
Bifunctional epoxide hydrolase 2
Ligand
BDBM50241116
Substrate
Meas. Tech.
ChEMBL_1669596 (CHEMBL4019484)
IC50
1.000000±n/a nM
Citation
 Schmidt, JRotter, MWeiser, TWittmann, SWeizel, LKaiser, AHeering, JGoebel, TAngioni, CWurglics, MPaulke, AGeisslinger, GKahnt, ASteinhilber, DProschak, EMerk, D A Dual Modulator of Farnesoid X Receptor and Soluble Epoxide Hydrolase To Counter Nonalcoholic Steatohepatitis. J Med Chem 60:7703-7724 (2017)  
Target
Name:
Bifunctional epoxide hydrolase 2
Synonyms:
Cytosolic epoxide hydrolase 2 EPHX2 HYES_HUMAN Soluble epoxide hydrolase (sEH) | epoxide hydrolase 2, cytoplasmic
Type:
Enzyme
Mol. Mass.:
62613.07
Organism:
Homo sapiens (Human)
Description:
P34913
Residue:
555
  
Inhibitor
Name:
BDBM50241116
Synonyms:
CHEMBL4066332
Type:
Small organic molecule
Emp. Form.:
C19H23ClN2O3S
Mol. Mass.:
394.916
SMILES:
CC(C)(C)c1ccc(cc1)C(=O)NCc1ccc(NS(C)(=O)=O)cc1Cl
: