Target
Bifunctional epoxide hydrolase 2
Ligand
BDBM50241151
Substrate
Meas. Tech.
ChEMBL_1669528 (CHEMBL4019416)
IC50
8.9±n/a nM
Citation
 Schmidt, JRotter, MWeiser, TWittmann, SWeizel, LKaiser, AHeering, JGoebel, TAngioni, CWurglics, MPaulke, AGeisslinger, GKahnt, ASteinhilber, DProschak, EMerk, D A Dual Modulator of Farnesoid X Receptor and Soluble Epoxide Hydrolase To Counter Nonalcoholic Steatohepatitis. J Med Chem 60:7703-7724 (2017)  
Target
Name:
Bifunctional epoxide hydrolase 2
Synonyms:
Cytosolic epoxide hydrolase 2 EPHX2 HYES_HUMAN Soluble epoxide hydrolase (sEH) | epoxide hydrolase 2, cytoplasmic
Type:
Enzyme
Mol. Mass.:
62613.07
Organism:
Homo sapiens (Human)
Description:
P34913
Residue:
555
  
Inhibitor
Name:
BDBM50241151
Synonyms:
CHEMBL4087681
Type:
Small organic molecule
Emp. Form.:
C20H20ClF3N2O2
Mol. Mass.:
412.833
SMILES:
CC(C)(C)c1ccc(cc1)C(=O)NCc1ccc(NC(=O)C(F)(F)F)cc1Cl
: