Target
Platelet-derived growth factor receptor alpha
Ligand
BDBM28031
Substrate
Meas. Tech.
ChEMBL_1671230 (CHEMBL4021259)
IC50
28±n/a nM
Citation
 Zhao, YZhang, JZhuang, RHe, RXi, JPan, XShao, YPan, JSun, JCai, ZLiu, SHuang, WLv, X Synthesis and evaluation of a series of pyridine and pyrimidine derivatives as type II c-Met inhibitors. Bioorg Med Chem 25:3195-3205 (2017)  
Target
Name:
Platelet-derived growth factor receptor alpha
Synonyms:
Alpha-type platelet-derived growth factor receptor PDGFRA PGFRA_HUMAN Platelet-derived growth factor receptor alpha (PDGFRA) RHEPDGFRA
Type:
Protein
Mol. Mass.:
122633.38
Organism:
Homo sapiens (Human)
Description:
P16234
Residue:
1089
  
Inhibitor
Name:
BDBM28031
Synonyms:
BMS-777607 | N-{4-[(2-amino-3-chloropyridin-4-yl)oxy]-3-fluorophenyl}-4-ethoxy-1-(4-fluorophenyl)-2-oxo-1,2-dihydropyridine-3-carboxamide
Type:
Small organic molecule
Emp. Form.:
C25H19ClF2N4O4
Mol. Mass.:
512.893
SMILES:
CCOc1ccn(-c2ccc(F)cc2)c(=O)c1C(=O)Nc1ccc(Oc2ccnc(N)c2Cl)c(F)c1
: