Target
Neutrophil elastase
Ligand
BDBM50004184
Substrate
Meas. Tech.
ChEBML_63655
pH
7.5±n/a
IC50
84.0±n/a nM
Comments
extracted
Citation
 Skiles, JWMiao, CSorcek, RJacober, SMui, PWChow, GWeldon, SMPossanza, GSkoog, MKeirns, J Inhibition of human leukocyte elastase by N-substituted peptides containing alpha,alpha-difluorostatone residues at P1. J Med Chem 35:4795-808 (1993)  
Target
Name:
Neutrophil elastase
Synonyms:
Bone marrow serine protease Coagulation factor X ELANE Elastase HLE Leukocyte elastase Medullasin Neutrophil elastase (HNE) PMN elastase Trypsin
Type:
Enzyme
Mol. Mass.:
28532.38
Organism:
Homo sapiens (Human)
Description:
P08246
Residue:
267
  
Inhibitor
Name:
BDBM50004184
Synonyms:
4-(4-Chloro-benzenesulfonylaminocarbonyl)-N-((S)-1-{indan-2-yl-[(3,3,3-trifluoro-1-isopropyl-2-oxo-propylcarbamoyl)-methyl]-carbamoyl}-2-methyl-propyl)-benzamide CHEMBL262218
Type:
Small organic molecule
Emp. Form.:
C36H38ClF3N4O7S
Mol. Mass.:
763.223
SMILES:
CC(C)[C@H](NC(=O)c1ccc(cc1)C(=O)NS(=O)(=O)c1ccc(Cl)cc1)C(=O)N(CC(=O)NC(C(C)C)C(=O)C(F)(F)F)C1Cc2ccccc2C1
: