Target
Histone deacetylase 8
Ligand
BDBM50439674
Substrate
Meas. Tech.
ChEMBL_1678054 (CHEMBL4028197)
IC50
100±n/a nM
Citation
 Lee, HYNepali, KHuang, FIChang, CYLai, MJLi, YHHuang, HLYang, CRLiou, JP (N-Hydroxycarbonylbenylamino)quinolines as Selective Histone Deacetylase 6 Inhibitors Suppress Growth of Multiple Myeloma in Vitro and in Vivo. J Med Chem 61:905-917 (2018)  
Target
Name:
Histone deacetylase 8
Synonyms:
HD8 HDAC8_HUMAN Histone deacetylase 8 (HDAC-8) | Human HDAC8
Type:
Enzyme
Mol. Mass.:
41749.60
Organism:
Homo sapiens (Human)
Description:
Q9BY41
Residue:
377
  
Inhibitor
Name:
BDBM50439674
Synonyms:
RICOLINOSTAT US11207431, Example E US8609678, 2-(diphenylamino)-N-(7-(hydroxyamino)-7-oxoheptyl)pyrimidine-5-carboxamide [26]
Type:
Small organic molecule
Emp. Form.:
C24H27N5O3
Mol. Mass.:
433.5029
SMILES:
ONC(=O)CCCCCCNC(=O)c1cnc(nc1)N(c1ccccc1)c1ccccc1
: