Target
Histone deacetylase 11
Ligand
BDBM50250135
Substrate
Meas. Tech.
ChEBML_1681050
IC50
31±n/a nM
Citation
 Yao, LMustafa, NTan, ECPoulsen, ASingh, PDuong-Thi, MDLee, JXTRamanujulu, PMChng, WJYen, JJYOhlson, SDymock, BW Design and Synthesis of Ligand Efficient Dual Inhibitors of Janus Kinase (JAK) and Histone Deacetylase (HDAC) Based on Ruxolitinib and Vorinostat. J Med Chem 60:8336-8357 (2017)  
Target
Name:
Histone deacetylase 11
Synonyms:
HD11 HDAC11 | Human HDAC11
Type:
Chromatin regulator; hydrolase; repressor
Mol. Mass.:
39187.66
Organism:
Homo sapiens (Human)
Description:
Q96DB2
Residue:
347
  
Inhibitor
Name:
BDBM50250135
Synonyms:
CHEMBL4060201
Type:
Small organic molecule
Emp. Form.:
C16H20N6O2
Mol. Mass.:
328.369
SMILES:
ONC(=O)CCCCCCn1cc(cn1)-c1ncnc2[nH]ccc12
: