Target
Vascular endothelial growth factor receptor 2
Ligand
BDBM50331094
Substrate
Meas. Tech.
ChEMBL_1682977 (CHEMBL4033254)
IC50
4.0±n/a nM
Citation
 Zhang, YChen, YZhang, DWang, LLu, TJiao, Y Discovery of Novel Potent VEGFR-2 Inhibitors Exerting Significant Antiproliferative Activity against Cancer Cell Lines. J Med Chem 61:140-157 (2018)  
Target
Name:
Vascular endothelial growth factor receptor 2
Synonyms:
CD_antigen=CD309 Fetal liver kinase 1 (FLK-1) KDR Protein-tyrosine kinase receptor Flk-1 VEGFR-2 VEGFR2 Vascular Endothelial Growth Factor Receptor Kinase 2 Vascular endothelial growth factor receptor 2 (KDR) Vascular endothelial growth factor receptor 2 (VEGFR2) Vascular endothelial growth factor receptor-2 (VEGFR-2)
Type:
Receptor Tyrosine Kinase
Mol. Mass.:
151510.97
Organism:
Homo sapiens (Human)
Description:
P35968
Residue:
1356
  
Inhibitor
Name:
BDBM50331094
Synonyms:
4-(3-chloro-4-(3-cyclopropylureido)phenoxy)-7-methoxyquinoline-6-carboxamide CHEMBL1289601 Lenvatinib mesilate lenvatinib
Type:
Small organic molecule
Emp. Form.:
C21H19ClN4O4
Mol. Mass.:
426.853
SMILES:
COc1cc2nccc(Oc3ccc(NC(=O)NC4CC4)c(Cl)c3)c2cc1C(N)=O
: