Target
P2X purinoceptor 7
Ligand
BDBM254381
Substrate
Meas. Tech.
ChEBML_1683148
IC50
8.0±n/a nM
Citation
 Chrovian, CCSoyode-Johnson, APeterson, AAGelin, CFDeng, XDvorak, CACarruthers, NILord, BFraser, IAluisio, LCoe, KJScott, BKoudriakova, TSchoetens, FSepassi, KGallacher, DJBhattacharya, ALetavic, MA A Dipolar Cycloaddition Reaction To Access 6-Methyl-4,5,6,7-tetrahydro-1H-[1,2,3]triazolo[4,5-c]pyridines Enables the Discovery Synthesis and Preclinical Profiling of a P2X7 Antagonist Clinical Candidate. J Med Chem 61:207-223 (2018)  
Target
Name:
P2X purinoceptor 7
Synonyms:
ATP receptor P2RX7_HUMAN P2X purinoceptor 7 (P2X7) P2Z receptor | Purinergic receptor
Type:
Protein
Mol. Mass.:
68602.85
Organism:
Homo sapiens (Human)
Description:
Q99572
Residue:
595
  
Inhibitor
Name:
BDBM254381
Synonyms:
US10112937, Example 288 US10703749, Example 288 | US9464084, 288
Type:
Small organic molecule
Emp. Form.:
C20H16ClF3N4O
Mol. Mass.:
420.815
SMILES:
C[C@H]1Cc2c(CN1C(=O)c1cccc(c1Cl)C(F)(F)F)nnn2-c1ccccc1
: