Target
Epidermal growth factor receptor
Ligand
BDBM50251948
Substrate
Meas. Tech.
ChEBML_1684313
IC50
3100±n/a nM
Citation
 Zha, GFQin, HLYoussif, BGMAmjad, MWRaja, MAGAbdelazeem, AHBukhari, SNA Discovery of potential anticancer multi-targeted ligustrazine based cyclohexanone and oxime analogs overcoming the cancer multidrug resistance. Eur J Med Chem 135:34-48 (2017)  
Target
Name:
Epidermal growth factor receptor
Synonyms:
EGF Receptor Substrate EGFR_HUMAN ERBB1 Epidermal Growth Factor Receptor erbB-1 Epidermal growth factor receptor (EGFR) HER1 Proto-oncogene c-ErbB-1 Tyrosine-Protein Kinase ErbB-1
Type:
Receptor Kinase Domain
Mol. Mass.:
134279.59
Organism:
Homo sapiens (Human)
Description:
P00533
Residue:
1210
  
Inhibitor
Name:
BDBM50251948
Synonyms:
CHEMBL4075241
Type:
Small organic molecule
Emp. Form.:
C25H30ClN3O3
Mol. Mass.:
455.977
SMILES:
COc1cc(Cl)c(\C=C2/CN(C\C(=C/c3nc(C)c(C)nc3C)C2=O)C(C)C)cc1OC
: