Target
Alpha-1A adrenergic receptor
Ligand
BDBM50006956
Substrate
Meas. Tech.
ChEMBL_33277 (CHEMBL644237)
Ki
>100000±n/a nM
Citation
 Russo, FRomeo, GGuccione, SDe Blasi, A Pyrimido[5,4-b]indole derivatives. 1. A new class of potent and selective alpha 1 adrenoceptor ligands. J Med Chem 34:1850-4 (1991)  
Target
Name:
Alpha-1A adrenergic receptor
Synonyms:
ADA1A_RAT Adra1c Alpha-1A adrenoceptor Alpha-1C adrenergic receptor | adrenergic Alpha1A
Type:
Protein
Mol. Mass.:
51620.15
Organism:
Rattus norvegicus (Rat)
Description:
P43140
Residue:
466
  
Inhibitor
Name:
BDBM50006956
Synonyms:
2-(2-Pyrrolidin-1-yl-ethyl)-4,9-dihydro-2,4,9-triaza-fluorene-1,3-dione | CHEMBL55457
Type:
Small organic molecule
Emp. Form.:
C16H18N4O2
Mol. Mass.:
298.3397
SMILES:
O=c1[nH]c2c3ccccc3[nH]c2c(=O)n1CCN1CCCC1
: