Target
Beta-1/Beta-2/Beta-3 adrenergic receptor
Ligand
BDBM50007477
Substrate
Meas. Tech.
ChEMBL_38733 (CHEMBL647417)
EC50
9.2±n/a nM
Citation
 Adejare, ANie, JYHebel, DBrackett, LEChoi, OGusovsky, FPadgett, WLDaly, JWCreveling, CRKirk, KL Effect of fluorine substitution on the adrenergic properties of 3-(tert-butylamino)-1-(3,4-dihydroxyphenoxy)-2-propanol. J Med Chem 34:1063-8 (1991)  
Target
Name:
Beta-1/Beta-2/Beta-3 adrenergic receptor
Synonyms:
Adrenergic receptor beta
Type:
Mol. Mass.:
Description:
ASSAY_ID of ChEMBL is 1340543
Components:
This complex has 3 components.
Component 1
Name:
Beta-1 adrenergic receptor
Synonyms:
ADRB1R, B1AR Adrb1 Adrenergic receptor beta Beta-1 adrenoreceptor adrenergic Beta1,2
Type:
Protein
Mol. Mass.:
50486.84
Organism:
Rattus norvegicus (Rat)
Description:
P18090
Residue:
466
  
Component 2
Name:
Beta-2 adrenergic receptor
Synonyms:
ADRB2_RAT Adrb2r | Adrenergic receptor beta
Type:
PROTEIN
Mol. Mass.:
46896.26
Organism:
Rattus norvegicus
Description:
ChEMBL_38603
Residue:
418
  
Component 3
Name:
Beta-3 adrenergic receptor
Synonyms:
ADRB3_RAT Adrb3r Beta-3 adrenergic receptor
Type:
PROTEIN
Mol. Mass.:
43161.83
Organism:
Rattus norvegicus
Description:
ChEMBL_1509452
Residue:
400
  
Inhibitor
Name:
BDBM50007477
Synonyms:
4-(3-tert-Butylamino-2-hydroxy-propoxy)-3-fluoro-benzene-1,2-diol | CHEMBL10453
Type:
Small organic molecule
Emp. Form.:
C13H20FNO4
Mol. Mass.:
273.3006
SMILES:
CC(C)(C)NCC(O)COc1ccc(O)c(O)c1F
: