Target
Histamine H3 receptor
Ligand
BDBM50172447
Substrate
Meas. Tech.
ChEBML_1686321
Ki
11±n/a nM
Citation
 Schaller, DHagenow, SAlpert, GNaß, ASchulz, RBermudez, MStark, HWolber, G Systematic Data Mining Reveals Synergistic H3R/MCHR1 Ligands. ACS Med Chem Lett 8:648-653 (2017)  
Target
Name:
Histamine H3 receptor
Synonyms:
G-protein coupled receptor 97 HH3R HRH3 Histamine H3 receptor (H3) Histamine receptor (H3 and H4)
Type:
G Protein-Coupled Receptor (GPCR)
Mol. Mass.:
48691.47
Organism:
Homo sapiens (Human)
Description:
Binding assays were using CHO cells stably expressing hH3R receptors.
Residue:
445
  
Inhibitor
Name:
BDBM50172447
Synonyms:
(E)-N-[2-(4-Ethyl-piperazin-1-yl)-4-methyl-quinolin-6-yl]-3-(4-methoxy-phenyl)-acrylamide GNF-Pf-1550
Type:
Small organic molecule
Emp. Form.:
C26H30N4O2
Mol. Mass.:
430.542
SMILES:
CCN1CCN(CC1)c1cc(C)c2cc(NC(=O)\C=C\c3ccc(OC)cc3)ccc2n1
: