Target
Histamine H3 receptor
Ligand
BDBM50241083
Substrate
Meas. Tech.
ChEBML_1686321
Ki
208±n/a nM
Citation
 Schaller, DHagenow, SAlpert, GNaß, ASchulz, RBermudez, MStark, HWolber, G Systematic Data Mining Reveals Synergistic H3R/MCHR1 Ligands. ACS Med Chem Lett 8:648-653 (2017)  
Target
Name:
Histamine H3 receptor
Synonyms:
G-protein coupled receptor 97 HH3R HRH3 Histamine H3 receptor (H3) Histamine receptor (H3 and H4)
Type:
G Protein-Coupled Receptor (GPCR)
Mol. Mass.:
48691.47
Organism:
Homo sapiens (Human)
Description:
Binding assays were using CHO cells stably expressing hH3R receptors.
Residue:
445
  
Inhibitor
Name:
BDBM50241083
Synonyms:
6-(4-chlorophenyl)-3-(3-methoxy-4-(2-(pyrrolidin-1-yl)ethoxy)phenyl)thieno[3,2-d]pyrimidin-4(3H)-one GW-3430
Type:
Small organic molecule
Emp. Form.:
C25H24ClN3O3S
Mol. Mass.:
481.994
SMILES:
COc1cc(ccc1OCCN1CCCC1)-n1cnc2cc(sc2c1=O)-c1ccc(Cl)cc1
: