Target
Cholecystokinin receptor type A
Ligand
BDBM50007917
Substrate
Meas. Tech.
ChEMBL_49573 (CHEMBL661827)
IC50
16±n/a nM
Citation
 Shiosaki, KLin, CWKopecka, HTufano, MDBianchi, BRMiller, TRWitte, DGNadzan, AM Boc-CCK-4 derivatives containing side-chain ureas as potent and selective CCK-a receptor agonists. J Med Chem 34:2837-42 (1991)  
Target
Name:
Cholecystokinin receptor type A
Synonyms:
CCK-A receptor CCK1-R CCKAR_CAVPO Cholecystokinin receptor type A | Cholecystokinin-1 receptor
Type:
Mol. Mass.:
48229.77
Organism:
Cavia porcellus
Description:
Residue:
430
  
Inhibitor
Name:
BDBM50007917
Synonyms:
3-{1-[1-aminobutyl oxycarbonylamino-2-(1H-3-indolyl)ethylcarboxamido]-5-formamidometa-methyl phenylaminopentylcarboxamido}-3-(1-carbamoyl-2-phenylethylcarbamoyl)propanoic acid | CHEMBL98468
Type:
Small organic molecule
Emp. Form.:
C43H54N8O9
Mol. Mass.:
826.9371
SMILES:
Cc1cccc(NC(=O)NCCCC[C@H](NC(=O)[C@H](Cc2c[nH]c3ccccc23)NC(=O)OC(C)(C)C)C(=O)N[C@@H](CC(O)=O)C(=O)N[C@@H](Cc2ccccc2)C(N)=O)c1
: