Target
Gastrin/cholecystokinin type B receptor
Ligand
BDBM50008007
Substrate
Meas. Tech.
ChEBML_47815
IC50
2600±n/a nM
Citation
 Shiosaki, KLin, CWKopecka, HTufano, MDBianchi, BRMiller, TRWitte, DGNadzan, AM Boc-CCK-4 derivatives containing side-chain ureas as potent and selective CCK-a receptor agonists. J Med Chem 34:2837-42 (1991)  
Target
Name:
Gastrin/cholecystokinin type B receptor
Synonyms:
CCK-2 receptor CCK-BR CCKRB Cholecystokinin receptor GASR_HUMAN | Gastrin/cholecystokinin type B receptor
Type:
G Protein-Coupled Receptor (GPCR)
Mol. Mass.:
48445.79
Organism:
Homo sapiens (Human)
Description:
Stable expression of human CCK-2 receptors in HEK 293 cells.
Residue:
447
  
Inhibitor
Name:
BDBM50008007
Synonyms:
3-{2-[2-tert-Butoxycarbonylamino-3-(1H-indol-3-yl)-propionylamino]-6-[3-(3-chloro-phenyl)-ureido]-hexanoylamino}-N-(1-carbamoyl-2-phenyl-ethyl)-succinamic acid | CHEMBL3142692
Type:
Small organic molecule
Emp. Form.:
C42H51ClN8O9
Mol. Mass.:
847.356
SMILES:
CC(C)(C)OC(=O)N[C@@H](Cc1c[nH]c2ccccc12)C(=O)N[C@@H](CCCCNC(=O)Nc1cccc(Cl)c1)C(=O)N[C@@H](CC(O)=O)C(=O)N[C@@H](Cc1ccccc1)C(N)=O
: