Target
Acetylcholinesterase
Ligand
BDBM50008567
Substrate
Meas. Tech.
ChEMBL_29409 (CHEMBL643382)
IC50
4900±n/a nM
Citation
 Cardozo, MGIimura, YSugimoto, HYamanishi, YHopfinger, AJ QSAR analyses of the substituted indanone and benzylpiperidine rings of a series of indanone-benzylpiperidine inhibitors of acetylcholinesterase. J Med Chem 35:584-9 (1992)  
Target
Name:
Acetylcholinesterase
Synonyms:
ACES_HUMAN Acetylcholinesterase (AChE) | Acetylcholinesterase (human AChE)
Type:
Enzyme
Mol. Mass.:
67792.70
Organism:
Homo sapiens (Human)
Description:
P22303
Residue:
614
  
Inhibitor
Name:
BDBM50008567
Synonyms:
1,4-Dimethylbenzol 4-methyltoluene CHEMBL31561 p-dimethylbenzene para-xylene
Type:
Small organic molecule
Emp. Form.:
C8H10
Mol. Mass.:
106.165
SMILES:
Cc1ccc(C)cc1
: