Target
Polycomb protein EED
Ligand
BDBM50259912
Substrate
Meas. Tech.
ChEBML_1691994
IC50
43000±n/a nM
Citation
 Lingel, ASendzik, MHuang, YShultz, MDCantwell, JDillon, MPFu, XFuller, JGabriel, TGu, JJiang, XLi, LLiang, FMcKenna, MQi, WRao, WSheng, XShu, WSutton, JTaft, BWang, LZeng, JZhang, HZhang, MZhao, KLindvall, MBussiere, DE Structure-Guided Design of EED Binders Allosterically Inhibiting the Epigenetic Polycomb Repressive Complex 2 (PRC2) Methyltransferase. J Med Chem 60:415-427 (2017)  
Target
Name:
Polycomb protein EED
Synonyms:
EED WAIT-1 hEED
Type:
Protein
Mol. Mass.:
50201.68
Organism:
Homo sapiens (Human)
Description:
O75530
Residue:
441
  
Inhibitor
Name:
BDBM50259912
Synonyms:
CHEMBL4088724
Type:
Small organic molecule
Emp. Form.:
C14H21N3O
Mol. Mass.:
247.336
SMILES:
COc1cccc(CC2CCCN(C2)C(N)=N)c1
: