Target
Signal transduction protein TRAP
Ligand
BDBM50260005
Substrate
Meas. Tech.
ChEMBL_1692279 (CHEMBL4042928)
EC50
29300±n/a nM
Citation
 Vermote, ABrackman, GRisseeuw, MDCappoen, DCos, PCoenye, TVan Calenbergh, S Novel Potentiators for Vancomycin in the Treatment of Biofilm-Related MRSA Infections via a Mix and Match Approach. ACS Med Chem Lett 8:38-42 (2017)  
Target
Name:
Signal transduction protein TRAP
Synonyms:
Signal transduction protein TRAP Target of RNAIII-activating protein | traP
Type:
PROTEIN
Mol. Mass.:
19547.99
Organism:
Staphylococcus aureus (strain Mu50 / ATCC 700699)
Description:
ChEMBL_117552
Residue:
167
  
Inhibitor
Name:
BDBM50260005
Synonyms:
CHEMBL4104220
Type:
Small organic molecule
Emp. Form.:
C18H22N4O5
Mol. Mass.:
374.3911
SMILES:
Cn1nccc1C(=O)NC[C@H]1OC[C@@](O)(CNC(=O)c2ccccc2)[C@@H]1O
: