Target
Vesicular acetylcholine transporter
Ligand
BDBM50260155
Substrate
Meas. Tech.
ChEBML_1692765
Ki
153±n/a nM
Citation
 Lindemann, MDeuther-Conrad, WMoldovan, RSekhar, KVGCBrust, PWenzel, B Do spiroindolines have the potential to replace vesamicol as lead compound for the development of radioligands targeting the vesicular acetylcholine transporter? Bioorg Med Chem 25:5107-5113 (2017)  
Target
Name:
Vesicular acetylcholine transporter
Synonyms:
Slc18a3 VACHT_RAT Vat | rVAT
Type:
PROTEIN
Mol. Mass.:
56533.41
Organism:
Rattus norvegicus
Description:
ChEMBL_1503353
Residue:
530
  
Inhibitor
Name:
BDBM50260155
Synonyms:
CHEMBL4073803
Type:
Small organic molecule
Emp. Form.:
C27H24Cl2FN3O
Mol. Mass.:
496.403
SMILES:
Fc1ccc2N(CC3(CCN(C\C=C\c4ccc(Cl)cc4)CC3)c2c1)C(=O)c1ccnc(Cl)c1
: