Target
Mu-type opioid receptor
Ligand
BDBM50260247
Substrate
Meas. Tech.
ChEBML_1693458
Ki
21±n/a nM
Citation
 Kutsumura, NKoyama, YNagumo, YNakajima, RMiyata, YYamamoto, NSaitoh, TYoshida, NIwata, SNagase, H Antitrichomonal activity of? opioid receptor antagonists, 7-benzylidenenaltrexone derivatives. Bioorg Med Chem 25:4375-4383 (2017)  
Target
Name:
Mu-type opioid receptor
Synonyms:
M-OR-1 MOR-1 MUOR1 Mu opiate receptor OPRM1 hMOP | mu-type opioid receptor isoform MOR-1
Type:
G Protein-Coupled Receptor (GPCR)
Mol. Mass.:
44789.51
Organism:
Homo sapiens (Human)
Description:
P35372
Residue:
400
  
Inhibitor
Name:
BDBM50260247
Synonyms:
CHEMBL2059381
Type:
Small organic molecule
Emp. Form.:
C27H26FNO4
Mol. Mass.:
447.498
SMILES:
[H][C@@]12Oc3c4c(C[C@@]5([H])N(CC6CC6)CC[C@@]14[C@@]5(O)C\C(=C/c1ccc(F)cc1)C2=O)ccc3O
: