Target
Delta-type opioid receptor
Ligand
BDBM50260244
Substrate
Meas. Tech.
ChEBML_1693459
Ki
3.7±n/a nM
Citation
 Kutsumura, NKoyama, YNagumo, YNakajima, RMiyata, YYamamoto, NSaitoh, TYoshida, NIwata, SNagase, H Antitrichomonal activity of? opioid receptor antagonists, 7-benzylidenenaltrexone derivatives. Bioorg Med Chem 25:4375-4383 (2017)  
Target
Name:
Delta-type opioid receptor
Synonyms:
D-OR-1 Delta opioid receptor OPIATE Delta OPRD1 OPRK1 | opioid receptor, delta 1
Type:
G Protein-Coupled Receptor (GPCR)
Mol. Mass.:
40382.98
Organism:
Homo sapiens (Human)
Description:
Competition binding assays were carried out using membrane preparations from transfected HN9.10 cells that constitutively expressed the delta opioid receptor.
Residue:
372
  
Inhibitor
Name:
BDBM50260244
Synonyms:
CHEMBL3632690
Type:
Small organic molecule
Emp. Form.:
C29H32N2O4
Mol. Mass.:
472.5754
SMILES:
[H][C@@]12Oc3c4c(C[C@@]5([H])N(CC6CC6)CC[C@@]14[C@@]5(O)C\C(=C/c1ccc(cc1)N(C)C)C2=O)ccc3O
: