Target
Kappa-type opioid receptor
Ligand
BDBM50260242
Substrate
Meas. Tech.
ChEBML_1693460
Ki
70±n/a nM
Citation
 Kutsumura, NKoyama, YNagumo, YNakajima, RMiyata, YYamamoto, NSaitoh, TYoshida, NIwata, SNagase, H Antitrichomonal activity of? opioid receptor antagonists, 7-benzylidenenaltrexone derivatives. Bioorg Med Chem 25:4375-4383 (2017)  
Target
Name:
Kappa-type opioid receptor
Synonyms:
K-OR-1 Kappa-opioid receptor (KOR) Kappa-type opioid receptor (KOR) OPIATE Kappa OPRK1 kappa opioid receptor (KOR)
Type:
G Protein-Coupled Receptor (GPCR)
Mol. Mass.:
42648.76
Organism:
Homo sapiens (Human)
Description:
P41145
Residue:
380
  
Inhibitor
Name:
BDBM50260242
Synonyms:
CHEMBL4071324
Type:
Small organic molecule
Emp. Form.:
C27H26BrNO4
Mol. Mass.:
508.404
SMILES:
[H][C@@]12Oc3c4c(C[C@@]5([H])N(CC6CC6)CC[C@@]14[C@@]5(O)C\C(=C/c1ccc(Br)cc1)C2=O)ccc3O
: