Target
Proprotein convertase subtilisin/kexin type 6
Ligand
BDBM50265119
Substrate
Meas. Tech.
ChEBML_1699614
Ki
0.400000±n/a nM
Citation
 Ma?uch, ILevesque, CKwiatkowska, ACouture, FLy, KDesjardins, RNeugebauer, WAPrahl, ADay, R Positional Scanning Identifies the Molecular Determinants of a High Affinity Multi-Leucine Inhibitor for Furin and PACE4. J Med Chem 60:2732-2744 (2017)  
Target
Name:
Proprotein convertase subtilisin/kexin type 6
Synonyms:
PACE4 PCSK6_HUMAN | Subtilisin/kexin type 6
Type:
PROTEIN
Mol. Mass.:
106442.22
Organism:
Homo sapiens (Human)
Description:
ChEMBL_1290742
Residue:
969
  
Inhibitor
Name:
BDBM50265119
Synonyms:
CHEMBL4091099
Type:
Small organic molecule
Emp. Form.:
C51H91N17O8
Mol. Mass.:
1070.3773
SMILES:
CC(C)C[C@H](NC(C)=O)C(=O)N[C@@H](CCCNC(N)=N)C(=O)N[C@@H](CC(C)C)C(=O)N[C@@H](CC(C)C)C(=O)N[C@@H](CCCNC(N)=N)C(=O)N[C@@H](C(C)C)C(=O)N[C@@H](CCCCN)C(=O)NCc1ccc(cc1)C(N)=N
: