Target
Furin
Ligand
BDBM50264971
Substrate
Meas. Tech.
ChEMBL_1699615 (CHEMBL4050597)
Ki
1.1±n/a nM
Citation
 Ma?uch, ILevesque, CKwiatkowska, ACouture, FLy, KDesjardins, RNeugebauer, WAPrahl, ADay, R Positional Scanning Identifies the Molecular Determinants of a High Affinity Multi-Leucine Inhibitor for Furin and PACE4. J Med Chem 60:2732-2744 (2017)  
Target
Name:
Furin
Synonyms:
FUR FURIN_HUMAN PACE | PCSK3
Type:
Enzyme Catalytic Domain
Mol. Mass.:
86676.01
Organism:
Homo sapiens (Human)
Description:
P09958
Residue:
794
  
Inhibitor
Name:
BDBM50264971
Synonyms:
CHEMBL4089913
Type:
Small organic molecule
Emp. Form.:
C50H86N14O8
Mol. Mass.:
1011.3068
SMILES:
CC(C)C[C@H](NC(=O)[C@H](CC(C)C)NC(=O)[C@H](CC(C)C)NC(=O)[C@@H]1CCCN1C(C)=O)C(=O)N[C@@H](CCCNC(N)=N)C(=O)N[C@@H](C(C)C)C(=O)N[C@@H](CCCCN)C(=O)NCc1ccc(cc1)C(N)=N
: