Target
Free fatty acid receptor 1
Ligand
BDBM50265898
Substrate
Meas. Tech.
ChEMBL_1700322 (CHEMBL4051304)
EC50
1500±n/a nM
Citation
 McCoull, WBailey, ABarton, PBirch, AMBrown, AJButler, HSBoyd, SButlin, RJChappell, BClarkson, PCollins, SDavies, RMErtan, AHammond, CDHolmes, JLLenaghan, CMidha, AMorentin-Gutierrez, PMoore, JERaubo, PRobb, G Indazole-6-phenylcyclopropylcarboxylic Acids as Selective GPR120 Agonists with in Vivo Efficacy. J Med Chem 60:3187-3197 (2017)  
Target
Name:
Free fatty acid receptor 1
Synonyms:
FFAR1_MOUSE Gpr40
Type:
PROTEIN
Mol. Mass.:
31818.80
Organism:
Mus musculus
Description:
ChEMBL_1454431
Residue:
300
  
Inhibitor
Name:
BDBM50265898
Synonyms:
CHEMBL4075162
Type:
Small organic molecule
Emp. Form.:
C22H18FN3O2
Mol. Mass.:
375.3956
SMILES:
Cc1nn(-c2ccccn2)c2cc(ccc12)-c1ccc(CCC(O)=O)cc1F
: