Target
Dihydrofolate reductase
Ligand
BDBM50011887
Substrate
Meas. Tech.
ChEBML_54103
IC50
8500±n/a nM
Citation
 Rosowsky, AForsch, RABader, HFreisheim, JH Synthesis and in vitro biological activity of new deaza analogues of folic acid, aminopterin, and methotrexate with an L-ornithine side chain. J Med Chem 34:1447-54 (1991)  
Target
Name:
Dihydrofolate reductase
Synonyms:
DHFR Dihydrofolate reductase (DHFR) | Tetrahydrofolate dehydrogenase
Type:
Enzyme
Mol. Mass.:
21453.99
Organism:
Homo sapiens (Human)
Description:
Recombinant human DHFR.
Residue:
187
  
Inhibitor
Name:
BDBM50011887
Synonyms:
5-Amino-2-{4-[(2-amino-4-oxo-3,4-dihydro-pyrido[2,3-d]pyrimidin-6-ylmethyl)-amino]-benzoylamino}-pentanoic acid | CHEMBL35231
Type:
Small organic molecule
Emp. Form.:
C20H23N7O4
Mol. Mass.:
425.4411
SMILES:
NCCCC(NC(=O)c1ccc(NCc2cnc3nc(N)[nH]c(=O)c3c2)cc1)C(O)=O
: