Target
Dihydrofolate reductase
Ligand
BDBM50011890
Substrate
Meas. Tech.
ChEBML_54103
IC50
35±n/a nM
Citation
 Rosowsky, AForsch, RABader, HFreisheim, JH Synthesis and in vitro biological activity of new deaza analogues of folic acid, aminopterin, and methotrexate with an L-ornithine side chain. J Med Chem 34:1447-54 (1991)  
Target
Name:
Dihydrofolate reductase
Synonyms:
DHFR Dihydrofolate reductase (DHFR) | Tetrahydrofolate dehydrogenase
Type:
Enzyme
Mol. Mass.:
21453.99
Organism:
Homo sapiens (Human)
Description:
Recombinant human DHFR.
Residue:
187
  
Inhibitor
Name:
BDBM50011890
Synonyms:
5-Amino-2-{4-[(2,4-diamino-quinazolin-6-ylmethyl)-amino]-benzoylamino}-pentanoic acid | CHEMBL32439
Type:
Small organic molecule
Emp. Form.:
C21H25N7O3
Mol. Mass.:
423.4683
SMILES:
NCCCC(NC(=O)c1ccc(NCc2ccc3nc(N)nc(N)c3c2)cc1)C(O)=O
: