Target
Aromatase
Ligand
BDBM50181473
Substrate
Meas. Tech.
ChEMBL_1705370 (CHEMBL4056603)
IC50
8400±n/a nM
Citation
 Yates, CMGarvey, EPShaver, SRSchotzinger, RJHoekstra, WJ Design and optimization of highly-selective, broad spectrum fungal CYP51 inhibitors. Bioorg Med Chem Lett 27:3243-3248 (2017)  
Target
Name:
Aromatase
Synonyms:
ARO1 CP19A_HUMAN CYP19 CYPXIX Cytochrome P450 19A1 Cytochrome P450-C19 (CYP19) FL cytokine receptor precursor | P-450AROM
Type:
Enzyme
Mol. Mass.:
57888.92
Organism:
Homo sapiens (Human)
Description:
P11511
Residue:
503
  
Inhibitor
Name:
BDBM50181473
Synonyms:
4-(4-(4-(4-(((3R,5R)-5-((1H-1,2,4-triazol-1-yl)methyl)-5-(2,4-difluorophenyl)-tetrahydrofuran-3-yl)methoxy)phenyl)piperazin-1-yl)phenyl)-2-((2S,3S)-2-hydroxypentan-3-yl)-2H-1,2,4-triazol-3(4H)-one 4-[4-(4-{4-[(R)-5-(2,4-difluoro-phenyl)-5-(4,5-dihydro-[1,2,4]triazol-1-ylmethyl)-tetrahydro-furan-3-ylmethoxy]-phenyl}-piperazin-1-yl)-phenyl]-2-((1S,2S)-1-ethyl-2-hydroxy-propyl)-2,4-dihydro-[1,2,4]triazol-3-one Noxafil pasaconazole
Type:
Small organic molecule
Emp. Form.:
C37H42F2N8O4
Mol. Mass.:
700.7774
SMILES:
CC[C@@H]([C@H](C)O)n1ncn(-c2ccc(cc2)N2CCN(CC2)c2ccc(OC[C@@H]3CO[C@](Cn4cncn4)(C3)c3ccc(F)cc3F)cc2)c1=O
: