Target
Ubiquitin carboxyl-terminal hydrolase 47
Ligand
BDBM50148911
Substrate
Meas. Tech.
ChEMBL_1709726 (CHEMBL4119775)
IC50
26000±n/a nM
Citation
 Wu, JKumar, SWang, FWang, HChen, LArsenault, PMattern, MWeinstock, J Chemical Approaches to Intervening in Ubiquitin Specific Protease 7 (USP7) Function for Oncology and Immune Oncology Therapies. J Med Chem 61:422-443 (2018)  
Target
Name:
Ubiquitin carboxyl-terminal hydrolase 47
Synonyms:
Deubiquitinating enzyme 47 USP47 Ubiquitin-specific-processing protease 47
Type:
PROTEIN
Mol. Mass.:
157255.08
Organism:
Homo sapiens (Human)
Description:
ChEMBL_855560
Residue:
1375
  
Inhibitor
Name:
BDBM50148911
Synonyms:
(3beta)-3-hydroxyurs-12-en-28-oic acid CHEMBL169 malol urson
Type:
Small organic molecule
Emp. Form.:
C30H48O3
Mol. Mass.:
456.7003
SMILES:
C[C@@H]1CC[C@@]2(CC[C@]3(C)C(=CC[C@@H]4[C@@]5(C)CC[C@H](O)C(C)(C)[C@@H]5CC[C@@]34C)[C@@H]2[C@H]1C)C(O)=O
: