Target
Neuraminidase
Ligand
BDBM50271265
Substrate
Meas. Tech.
ChEMBL_1710925 (CHEMBL4120974)
IC50
583±n/a nM
Citation
 McKimm-Breschkin, JLBarrett, SPilling, PAHader, SWatts, AGStreltsov, VA Structural and Functional Analysis of Anti-Influenza Activity of 4-, 7-, 8- and 9-Deoxygenated 2,3-Difluoro- N-acetylneuraminic Acid Derivatives. J Med Chem 61:1921-1933 (2018)  
Target
Name:
Neuraminidase
Synonyms:
Type:
PROTEIN
Mol. Mass.:
49043.64
Organism:
Influenza A virus
Description:
ChEMBL_1438329
Residue:
449
  
Inhibitor
Name:
BDBM50271265
Synonyms:
CHEMBL4126987
Type:
Small organic molecule
Emp. Form.:
C11H17F2NO7
Mol. Mass.:
313.252
SMILES:
[H][C@]1(O[C@](F)([C@H](F)C[C@H]1NC(C)=O)C(O)=O)[C@H](O)[C@H](O)CO
: