Target
Neuraminidase
Ligand
BDBM50271265
Substrate
Meas. Tech.
ChEMBL_1710917 (CHEMBL4120966)
IC50
24±n/a nM
Citation
 McKimm-Breschkin, JLBarrett, SPilling, PAHader, SWatts, AGStreltsov, VA Structural and Functional Analysis of Anti-Influenza Activity of 4-, 7-, 8- and 9-Deoxygenated 2,3-Difluoro- N-acetylneuraminic Acid Derivatives. J Med Chem 61:1921-1933 (2018)  
Target
Name:
Neuraminidase
Synonyms:
NA | NRAM_I33A0
Type:
PROTEIN
Mol. Mass.:
49687.56
Organism:
Influenza A virus
Description:
ChEMBL_1347422
Residue:
453
  
Inhibitor
Name:
BDBM50271265
Synonyms:
CHEMBL4126987
Type:
Small organic molecule
Emp. Form.:
C11H17F2NO7
Mol. Mass.:
313.252
SMILES:
[H][C@]1(O[C@](F)([C@H](F)C[C@H]1NC(C)=O)C(O)=O)[C@H](O)[C@H](O)CO
: