Target
Diacylglycerol O-acyltransferase 1
Ligand
BDBM50272088
Substrate
Meas. Tech.
ChEMBL_1712182 (CHEMBL4122231)
EC50
20±n/a nM
Citation
 Yu, TWu, CShih, NLi, QChan, CPan, HYao, DPan, YLiang, WShen, LZhao, HLi, JChen, S Discovery of dimethyl pent-4-ynoic acid derivatives, as potent and orally bioavailable DGAT1 inhibitors that suppress body weight in diet-induced mouse obesity model. Bioorg Med Chem Lett 28:1686-1692 (2018)  
Target
Name:
Diacylglycerol O-acyltransferase 1
Synonyms:
ACAT-related gene product 1 Acyl coA-diacylglycerol acyl transferase 1 (DGAT1) DGAT1 Diacylglycerol Acyltransferase (DGAT1) Diacylglycerol O-acyltransferase 1 (DGAT1) | Diglyceride acyltransferase
Type:
Protein
Mol. Mass.:
55297.82
Organism:
Homo sapiens (Human)
Description:
O75907
Residue:
488
  
Inhibitor
Name:
BDBM50272088
Synonyms:
CHEMBL4126883
Type:
Small organic molecule
Emp. Form.:
C22H26N4O3
Mol. Mass.:
394.4668
SMILES:
CC(=O)C[C@H]1CC[C@@H](CC1)c1ccc(cc1)N1CCOc2ncnc(N)c2C1=O
: