Target
Diacylglycerol O-acyltransferase 1
Ligand
BDBM50272089
Substrate
Meas. Tech.
ChEMBL_1712182 (CHEMBL4122231)
EC50
26±n/a nM
Citation
 Yu, TWu, CShih, NLi, QChan, CPan, HYao, DPan, YLiang, WShen, LZhao, HLi, JChen, S Discovery of dimethyl pent-4-ynoic acid derivatives, as potent and orally bioavailable DGAT1 inhibitors that suppress body weight in diet-induced mouse obesity model. Bioorg Med Chem Lett 28:1686-1692 (2018)  
Target
Name:
Diacylglycerol O-acyltransferase 1
Synonyms:
ACAT-related gene product 1 Acyl coA-diacylglycerol acyl transferase 1 (DGAT1) DGAT1 Diacylglycerol Acyltransferase (DGAT1) Diacylglycerol O-acyltransferase 1 (DGAT1) | Diglyceride acyltransferase
Type:
Protein
Mol. Mass.:
55297.82
Organism:
Homo sapiens (Human)
Description:
O75907
Residue:
488
  
Inhibitor
Name:
BDBM50272089
Synonyms:
CHEMBL4126331
Type:
Small organic molecule
Emp. Form.:
C22H24N4O4
Mol. Mass.:
408.4504
SMILES:
Cc1cc(cc(C)c1C#CC(C)(C)CC(O)=O)N1CCOc2ncnc(N)c2C1=O
: