Target
Heat shock protein 75 kDa, mitochondrial
Ligand
BDBM50031735
Substrate
Meas. Tech.
ChEMBL_1714074 (CHEMBL4124123)
IC50
200±n/a nM
Citation
 Rondanin, RLettini, GOliva, PBaruchello, RCostantini, CTrapella, CSimoni, DBernardi, TSisinni, LPietrafesa, MPonterini, GCosti, MPVignudelli, TLuciani, RMatassa, DSEsposito, FLandriscina, M New TRAP1 and Hsp90 chaperone inhibitors with cationic components: Preliminary studies on mitochondrial targeting. Bioorg Med Chem Lett 28:2289-2293 (2018)  
Target
Name:
Heat shock protein 75 kDa, mitochondrial
Synonyms:
HSP75 TRAP1_HUMAN
Type:
PROTEIN
Mol. Mass.:
80120.13
Organism:
Homo sapiens (Human)
Description:
ChEMBL_1478164
Residue:
704
  
Inhibitor
Name:
BDBM50031735
Synonyms:
CHEMBL3360305
Type:
Small organic molecule
Emp. Form.:
C20H18FN5O2
Mol. Mass.:
379.3876
SMILES:
COc1cccc(n1)-c1cc(F)ccc1[C@H]1Cc2nc(N)nc(C)c2C(=O)N1
: