Target
Phosphatidylinositol 4,5-bisphosphate 3-kinase catalytic subunit delta isoform
Ligand
BDBM172634
Substrate
Meas. Tech.
ChEMBL_1719135 (CHEMBL4134135)
Ki
0.780000±n/a nM
Citation
 Safina, BSElliott, RLForrest, AKHeald, RAMurray, JMNonomiya, JPang, JSalphati, LSeward, EMStaben, STUltsch, MWei, BYang, WSutherlin, DP Design of Selective Benzoxazepin PI3K? Inhibitors Through Control of Dihedral Angles. ACS Med Chem Lett 8:936-940 (2017)  
Target
Name:
Phosphatidylinositol 4,5-bisphosphate 3-kinase catalytic subunit delta isoform
Synonyms:
PI3-kinase p110 subunit delta PI3-kinase subunit p110-delta PIK3CD Phosphatidylinositol 4,5-biphosphate 3-kinase catalytic subunit delta (PIK3CD) Phosphatidylinositol 4,5-bisphosphate 3-kinase 110 kDa catalytic subunit delta (PI3K delta) Phosphatidylinositol 4,5-bisphosphate 3-kinase catalytic subunit delta (PI3Kdelta) Phosphatidylinositol 4,5-bisphosphate 3-kinase catalytic subunit delta isoform (PI3K delta) Phosphatidylinositol 4,5-bisphosphate 3-kinase catalytic subunit delta isoform (PI3K-delta) Phosphatidylinositol 4,5-bisphosphate 3-kinase catalytic subunit delta isoform (PI3Kdelta)
Type:
Enzyme Subunit
Mol. Mass.:
119489.41
Organism:
Homo sapiens (Human)
Description:
O00329
Residue:
1044
  
Inhibitor
Name:
BDBM172634
Synonyms:
US9090628, 294
Type:
Small organic molecule
Emp. Form.:
C27H38FN7O
Mol. Mass.:
495.6353
SMILES:
CC(C)n1nc(C)nc1-c1cn2CCOc3cc(F)c(cc3-c2n1)[C@@H](C)N1CCN(CC1)C(C)(C)C
: