Target
Phosphatidylcholine:ceramide cholinephosphotransferase 2
Ligand
BDBM50282224
Substrate
Meas. Tech.
ChEMBL_1724008 (CHEMBL4139286)
IC50
6.5±n/a nM
Citation
 Adachi, ROgawa, KMatsumoto, SISatou, TTanaka, YSakamoto, JNakahata, TOkamoto, RKamaura, MKawamoto, T Discovery and characterization of selective human sphingomyelin synthase 2 inhibitors. Eur J Med Chem 136:283-293 (2017)  
Target
Name:
Phosphatidylcholine:ceramide cholinephosphotransferase 2
Synonyms:
SGMS2 SMS2_HUMAN | Sphingomyelin synthase 2
Type:
PROTEIN
Mol. Mass.:
42294.80
Organism:
Homo sapiens (Human)
Description:
ChEMBL_108027
Residue:
365
  
Inhibitor
Name:
BDBM50282224
Synonyms:
CHEMBL4172856
Type:
Small organic molecule
Emp. Form.:
C34H37F6N3O5
Mol. Mass.:
681.6651
SMILES:
CN(Cc1cc(cc(c1)C(F)(F)F)C(F)(F)F)C(=O)c1c(OCCCC2CCN(CC2)C(=O)OC2(C)CC2)c2ccccc2n(C)c1=O
: