Target
Bromodomain-containing protein 2
Ligand
BDBM313791
Substrate
Meas. Tech.
ChEMBL_1728754 (CHEMBL4144032)
IC50
3.0±n/a nM
Citation
 Sharp, PPGarnier, JMHatfaludi, TXu, ZSegal, DJarman, KEJousset, HGarnham, AFeutrill, JTCuzzupe, AHall, PTaylor, SWalkley, CRTyler, DDawson, MACzabotar, PWilks, AFGlaser, SHuang, DCSBurns, CJ Design, Synthesis, and Biological Activity of 1,2,3-Triazolobenzodiazepine BET Bromodomain Inhibitors. ACS Med Chem Lett 8:1298-1303 (2017)  
Target
Name:
Bromodomain-containing protein 2
Synonyms:
BRD2 Bromodomain and extra-terminal motif (BET) Bromodomain-containing protein 2 (BRD2) RING3
Type:
Protein
Mol. Mass.:
88085.95
Organism:
Homo sapiens (Human)
Description:
P25440
Residue:
801
  
Inhibitor
Name:
BDBM313791
Synonyms:
US10167292, Example 35
Type:
Small organic molecule
Emp. Form.:
C26H24ClN5O
Mol. Mass.:
457.955
SMILES:
C[C@H](NC(=O)c1ccc2-c3c(C)nnn3CCN(c3ccc(Cl)cc3)c2c1)c1ccccc1
: