Target
Cystic fibrosis transmembrane conductance regulator
Ligand
BDBM50289703
Substrate
Meas. Tech.
ChEMBL_1730606 (CHEMBL4146142)
EC50
2600±n/a nM
Citation
 Liessi, NCichero, EPesce, EArkel, MSalis, ATomati, VPaccagnella, MDamonte, GTasso, BGalietta, LJVPedemonte, NFossa, PMillo, E Synthesis and biological evaluation of novel thiazole- VX-809 hybrid derivatives as F508del correctors by QSAR-based filtering tools. Eur J Med Chem 144:179-200 (2018)  
Target
Name:
Cystic fibrosis transmembrane conductance regulator
Synonyms:
ABCC7 CFTR Channel conductance-controlling ATPase | cAMP-dependent chloride channel
Type:
Enzyme Catalytic Domain
Mol. Mass.:
168171.30
Organism:
Homo sapiens (Human)
Description:
gi_90421313
Residue:
1480
  
Inhibitor
Name:
BDBM50289703
Synonyms:
Lumacaftor VRT-826809 VX-809
Type:
Small organic molecule
Emp. Form.:
C24H18F2N2O5
Mol. Mass.:
452.4069
SMILES:
Cc1ccc(NC(=O)C2(CC2)c2ccc3OC(F)(F)Oc3c2)nc1-c1cccc(c1)C(O)=O
: